Target
Cell division control protein 42 homolog
Ligand
BDBM54701
Substrate
Meas. Tech.
Additional SAR compounds tested by Multiplex dose response to identify specific small molecule inhibitors of Ras and Ras-related GTPases specifically Cdc42 activated mutant
EC50
59156±n/a nM
Citation
 PubChem, PC Additional SAR compounds tested by Multiplex dose response to identify specific small molecule inhibitors of Ras and Ras-related GTPases specifically Cdc42 activated mutant PubChem Bioassay (2009)[AID] 
Target
Name:
Cell division control protein 42 homolog
Synonyms:
CDC42 Cell division control protein 42 homolog cell division cycle 42 (GTP binding protein, 25kDa)
Type:
PROTEIN
Mol. Mass.:
21258.36
Organism:
Homo sapiens (Human)
Description:
ChEMBL_652970
Residue:
191
  
Inhibitor
Name:
BDBM54701
Synonyms:
1-(4-fluorophenyl)-3-phenyl-2-propyn-1-one 1-(4-fluorophenyl)-3-phenylprop-2-yn-1-one cid_13200052
Type:
Small organic molecule
Emp. Form.:
C15H9FO
Mol. Mass.:
224.2298
SMILES:
Fc1ccc(cc1)C(=O)C#Cc1ccccc1
: