Target
Cell division control protein 42 homolog
Ligand
BDBM54689
Substrate
Meas. Tech.
Additional SAR compounds tested by Multiplex dose response to identify specific small molecule inhibitors of Ras and Ras-related GTPases specifically Cdc42 activated mutant
Ki
1540±n/a nM
Citation
 PubChem, PC Additional SAR compounds tested by Multiplex dose response to identify specific small molecule inhibitors of Ras and Ras-related GTPases specifically Cdc42 activated mutant PubChem Bioassay (2009)[AID] 
Target
Name:
Cell division control protein 42 homolog
Synonyms:
CDC42 Cell division control protein 42 homolog cell division cycle 42 (GTP binding protein, 25kDa)
Type:
PROTEIN
Mol. Mass.:
21258.36
Organism:
Homo sapiens (Human)
Description:
ChEMBL_652970
Residue:
191
  
Inhibitor
Name:
BDBM54689
Synonyms:
2-amino-5-benzoyl-4-(5-bromo-3-pyridinyl)-1-(4-methoxyphenyl)sulfonyl-3-pyrrolecarbonitrile 2-amino-5-benzoyl-4-(5-bromopyridin-3-yl)-1-(4-methoxyphenyl)sulfonylpyrrole-3-carbonitrile UNM-0000305779 | cid_25220930
Type:
Small organic molecule
Emp. Form.:
C24H17BrN4O4S
Mol. Mass.:
537.385
SMILES:
COc1ccc(cc1)S(=O)(=O)n1c(N)c(C#N)c(c1C(=O)c1ccccc1)-c1cncc(Br)c1
: