Target
Cell division control protein 42 homolog
Ligand
BDBM54707
Substrate
Meas. Tech.
Additional SAR compounds tested via Multiplex dose response to identify specific small molecule inhibitors of Ras and Ras-related GTPases specifically Cdc42 wildtype
EC50
30000±n/a nM
Citation
 PubChem, PC Additional SAR compounds tested via Multiplex dose response to identify specific small molecule inhibitors of Ras and Ras-related GTPases specifically Cdc42 wildtype PubChem Bioassay (2009)[AID] 
Target
Name:
Cell division control protein 42 homolog
Synonyms:
CDC42 Cell division control protein 42 homolog cell division cycle 42 (GTP binding protein, 25kDa)
Type:
PROTEIN
Mol. Mass.:
21258.36
Organism:
Homo sapiens (Human)
Description:
ChEMBL_652970
Residue:
191
  
Inhibitor
Name:
BDBM54707
Synonyms:
2-[(3E)-6-fluoranyl-2-methyl-3-[(4-methylsulfinylphenyl)methylidene]inden-1-yl]ethanoic acid 2-[(3E)-6-fluoro-2-methyl-3-[(4-methylsulfinylphenyl)methylidene]-1-indenyl]acetic acid UNM-0000306136 | cid_1548885
Type:
Small organic molecule
Emp. Form.:
C20H17FO3S
Mol. Mass.:
356.411
SMILES:
CC1=C(CC(O)=O)c2cc(F)ccc2\C1=C\c1ccc(cc1)S(C)=O
: