Target
Ras-related protein Rab-7a
Ligand
BDBM54575
Substrate
Meas. Tech.
Oxadiazole SAR compounds tested via Multiplex dose response to identify specific small molecule inhibitors of Ras and Ras-related GTPases specifically Rab7 wildtype
EC50
4198±n/a nM
Citation
 PubChem, PC Oxadiazole SAR compounds tested via Multiplex dose response to identify specific small molecule inhibitors of Ras and Ras-related GTPases specifically Rab7 wildtype PubChem Bioassay (2009)[AID] 
Target
Name:
Ras-related protein Rab-7a
Synonyms:
GTP-binding protein (rab7) RAB7A | RAB7A_CANLF
Type:
Enzyme Catalytic Domain
Mol. Mass.:
23519.50
Organism:
Canis lupus familiaris
Description:
gi_164058
Residue:
207
  
Inhibitor
Name:
BDBM54575
Synonyms:
3-[3-(2-bromophenyl)-1,2,4-oxadiazol-5-yl]-1-[4-(2,5-dimethylphenyl)-1-piperazinyl]-1-propanone 3-[3-(2-bromophenyl)-1,2,4-oxadiazol-5-yl]-1-[4-(2,5-dimethylphenyl)piperazino]propan-1-one UNM-0000306119 | cid_42628044
Type:
Small organic molecule
Emp. Form.:
C23H25BrN4O2
Mol. Mass.:
469.374
SMILES:
Cc1ccc(C)c(c1)N1CCN(CC1)C(=O)CCc1nc(no1)-c1ccccc1Br
: