Target
Ras-related protein Rab-7a
Ligand
BDBM54587
Substrate
Meas. Tech.
Pyrazoline SAR compounds tested via Multiplex dose response to identify specific small molecule inhibitors of Ras and Ras-related GTPases specifically Rab7 wildtype
EC50
30000±n/a nM
Citation
 PubChem, PC Pyrazoline SAR compounds tested via Multiplex dose response to identify specific small molecule inhibitors of Ras and Ras-related GTPases specifically Rab7 wildtype PubChem Bioassay (2009)[AID] 
Target
Name:
Ras-related protein Rab-7a
Synonyms:
GTP-binding protein (rab7) RAB7A | RAB7A_CANLF
Type:
Enzyme Catalytic Domain
Mol. Mass.:
23519.50
Organism:
Canis lupus familiaris
Description:
gi_164058
Residue:
207
  
Inhibitor
Name:
BDBM54587
Synonyms:
1-(4-nitrophenyl)-3,5-diphenyl-2-pyrazoline UNM-0000305825 | cid_2827281
Type:
Small organic molecule
Emp. Form.:
C21H17N3O2
Mol. Mass.:
343.3786
SMILES:
[O-][N+](=O)c1ccc(cc1)[N+]1=N[C-](CC1c1ccccc1)c1ccccc1
: