Target
Ras-related protein Rab-7a
Ligand
BDBM54601
Substrate
Meas. Tech.
Pyrazoline SAR compounds tested via Multiplex dose response to identify specific small molecule inhibitors of Ras and Ras-related GTPases specifically Rab7 wildtype
EC50
30000±n/a nM
Citation
 PubChem, PC Pyrazoline SAR compounds tested via Multiplex dose response to identify specific small molecule inhibitors of Ras and Ras-related GTPases specifically Rab7 wildtype PubChem Bioassay (2009)[AID] 
Target
Name:
Ras-related protein Rab-7a
Synonyms:
GTP-binding protein (rab7) RAB7A | RAB7A_CANLF
Type:
Enzyme Catalytic Domain
Mol. Mass.:
23519.50
Organism:
Canis lupus familiaris
Description:
gi_164058
Residue:
207
  
Inhibitor
Name:
BDBM54601
Synonyms:
UNM-0000305839 [4-(2,3-diphenyl-3,4-dihydropyrazol-5-yl)phenyl] ethanoate acetic acid [4-(2,3-diphenyl-3,4-dihydropyrazol-5-yl)phenyl] ester | cid_2849108
Type:
Small organic molecule
Emp. Form.:
C23H20N2O2
Mol. Mass.:
356.4171
SMILES:
CC(=O)Oc1ccc(cc1)C1=NN(C(C1)c1ccccc1)c1ccccc1
: