Target
Ras-related protein Rab-7a
Ligand
BDBM54619
Substrate
Meas. Tech.
Pyrazoline SAR compounds tested via Multiplex dose response to identify specific small molecule inhibitors of Ras and Ras-related GTPases specifically Rab7 wildtype
EC50
30000±n/a nM
Citation
 PubChem, PC Pyrazoline SAR compounds tested via Multiplex dose response to identify specific small molecule inhibitors of Ras and Ras-related GTPases specifically Rab7 wildtype PubChem Bioassay (2009)[AID] 
Target
Name:
Ras-related protein Rab-7a
Synonyms:
GTP-binding protein (rab7) RAB7A | RAB7A_CANLF
Type:
Enzyme Catalytic Domain
Mol. Mass.:
23519.50
Organism:
Canis lupus familiaris
Description:
gi_164058
Residue:
207
  
Inhibitor
Name:
BDBM54619
Synonyms:
3-(4-chlorophenyl)-5-(3,4-dimethoxyphenyl)-1-phenyl-2-pyrazoline UNM-0000305858 | cid_2883031
Type:
Small organic molecule
Emp. Form.:
C23H21ClN2O2
Mol. Mass.:
392.878
SMILES:
COc1ccc(cc1OC)C1CC(=NN1c1ccccc1)c1ccc(Cl)cc1
: