Target
Ras-related protein Rab-7a
Ligand
BDBM54672
Substrate
Meas. Tech.
Pyrazoline SAR compounds tested via Multiplex dose response to identify specific small molecule inhibitors of Ras and Ras-related GTPases specifically Rab7 wildtype
EC50
30000±n/a nM
Citation
 PubChem, PC Pyrazoline SAR compounds tested via Multiplex dose response to identify specific small molecule inhibitors of Ras and Ras-related GTPases specifically Rab7 wildtype PubChem Bioassay (2009)[AID] 
Target
Name:
Ras-related protein Rab-7a
Synonyms:
GTP-binding protein (rab7) RAB7A | RAB7A_CANLF
Type:
Enzyme Catalytic Domain
Mol. Mass.:
23519.50
Organism:
Canis lupus familiaris
Description:
gi_164058
Residue:
207
  
Inhibitor
Name:
BDBM54672
Synonyms:
4-[3-(4-bromophenyl)-5-(3-methoxyphenyl)-3,4-dihydropyrazol-2-yl]benzenesulfonamide KUC103479N | cid_44216842
Type:
Small organic molecule
Emp. Form.:
C22H20BrN3O3S
Mol. Mass.:
486.382
SMILES:
COc1cccc(c1)C1=NN(C(C1)c1ccc(Br)cc1)c1ccc(cc1)S(N)(=O)=O
: