Target
Ras-related protein Rab-7a
Ligand
BDBM54623
Substrate
Meas. Tech.
Pyrazoline SAR compounds tested via Multiplex dose response to identify specific small molecule inhibitors of Ras and Ras-related GTPases specifically Rab7 wildtype
Ki
730±n/a nM
Citation
 PubChem, PC Pyrazoline SAR compounds tested via Multiplex dose response to identify specific small molecule inhibitors of Ras and Ras-related GTPases specifically Rab7 wildtype PubChem Bioassay (2009)[AID] 
Target
Name:
Ras-related protein Rab-7a
Synonyms:
GTP-binding protein (rab7) RAB7A | RAB7A_CANLF
Type:
Enzyme Catalytic Domain
Mol. Mass.:
23519.50
Organism:
Canis lupus familiaris
Description:
gi_164058
Residue:
207
  
Inhibitor
Name:
BDBM54623
Synonyms:
1-(2,5-dichlorophenyl)-3-(4-fluorophenyl)-5-(4-methoxyphenyl)-2-pyrazoline 2-[2,5-bis(chloranyl)phenyl]-5-(4-fluorophenyl)-3-(4-methoxyphenyl)-3,4-dihydropyrazole cid_25227385
Type:
Small organic molecule
Emp. Form.:
C22H17Cl2FN2O
Mol. Mass.:
415.288
SMILES:
COc1ccc(cc1)C1CC(=NN1c1cc(Cl)ccc1Cl)c1ccc(F)cc1
: