Target
GTPase KRas [1-37]
Ligand
BDBM54558
Substrate
Meas. Tech.
Oxadiazole SAR compounds tested via Multiplex dose response to identify specific small molecule inhibitors of Ras and Ras-related GTPases specifically Ras activated mutant
EC50
30000±n/a nM
Citation
 PubChem, PC Oxadiazole SAR compounds tested via Multiplex dose response to identify specific small molecule inhibitors of Ras and Ras-related GTPases specifically Ras activated mutant PubChem Bioassay (2009)[AID] 
Target
Name:
GTPase KRas [1-37]
Synonyms:
ras protein
Type:
Enzyme Catalytic Domain
Mol. Mass.:
4034.04
Organism:
Homo sapiens (Human)
Description:
gi_190938
Residue:
37
  
Inhibitor
Name:
BDBM54558
Synonyms:
1-[4-(2,5-dimethylphenyl)-1-piperazinyl]-2-[3-(4-methoxyphenyl)-1,2,4-oxadiazol-5-yl]ethanone 1-[4-(2,5-dimethylphenyl)piperazino]-2-[3-(4-methoxyphenyl)-1,2,4-oxadiazol-5-yl]ethanone UNM-0000306079 | cid_20900764
Type:
Small organic molecule
Emp. Form.:
C23H26N4O3
Mol. Mass.:
406.4775
SMILES:
COc1ccc(cc1)-c1noc(CC(=O)N2CCN(CC2)c2cc(C)ccc2C)n1
: