Target
GTPase KRas [1-37]
Ligand
BDBM54567
Substrate
Meas. Tech.
Oxadiazole SAR compounds tested via Multiplex dose response to identify specific small molecule inhibitors of Ras and Ras-related GTPases specifically Ras activated mutant
EC50
30000±n/a nM
Citation
 PubChem, PC Oxadiazole SAR compounds tested via Multiplex dose response to identify specific small molecule inhibitors of Ras and Ras-related GTPases specifically Ras activated mutant PubChem Bioassay (2009)[AID] 
Target
Name:
GTPase KRas [1-37]
Synonyms:
ras protein
Type:
Enzyme Catalytic Domain
Mol. Mass.:
4034.04
Organism:
Homo sapiens (Human)
Description:
gi_190938
Residue:
37
  
Inhibitor
Name:
BDBM54567
Synonyms:
1-[4-(2,5-dimethylphenyl)-1-piperazinyl]-3-[3-[3-(trifluoromethyl)phenyl]-1,2,4-oxadiazol-5-yl]-1-propanone 1-[4-(2,5-dimethylphenyl)piperazino]-3-[3-[3-(trifluoromethyl)phenyl]-1,2,4-oxadiazol-5-yl]propan-1-one UNM-0000306093 | cid_42608819
Type:
Small organic molecule
Emp. Form.:
C24H25F3N4O2
Mol. Mass.:
458.4761
SMILES:
Cc1ccc(C)c(c1)N1CCN(CC1)C(=O)CCc1nc(no1)-c1cccc(c1)C(F)(F)F
: