Target
GTPase KRas [1-37]
Ligand
BDBM54582
Substrate
Meas. Tech.
Oxadiazole SAR compounds tested via Multiplex dose response to identify specific small molecule inhibitors of Ras and Ras-related GTPases specifically Ras activated mutant
EC50
30000±n/a nM
Citation
 PubChem, PC Oxadiazole SAR compounds tested via Multiplex dose response to identify specific small molecule inhibitors of Ras and Ras-related GTPases specifically Ras activated mutant PubChem Bioassay (2009)[AID] 
Target
Name:
GTPase KRas [1-37]
Synonyms:
ras protein
Type:
Enzyme Catalytic Domain
Mol. Mass.:
4034.04
Organism:
Homo sapiens (Human)
Description:
gi_190938
Residue:
37
  
Inhibitor
Name:
BDBM54582
Synonyms:
1-[4-(2,5-dimethylphenyl)-1-piperazinyl]-3-[4-(4-methoxyphenyl)-2-oxazolyl]-1-propanone 1-[4-(2,5-dimethylphenyl)piperazino]-3-[4-(4-methoxyphenyl)oxazol-2-yl]propan-1-one UNM-0000306128 | cid_42628049
Type:
Small organic molecule
Emp. Form.:
C25H29N3O3
Mol. Mass.:
419.5161
SMILES:
COc1ccc(cc1)-c1coc(CCC(=O)N2CCN(CC2)c2cc(C)ccc2C)n1
: