Target
Ras-related protein Rab-2A
Ligand
BDBM54592
Substrate
Meas. Tech.
Pyrazoline SAR compounds tested via Multiplex dose response to identify specific small molecule inhibitors of Ras and Ras-related GTPases specifically Rab2 wildtype
EC50
30000±n/a nM
Comments
Extracted from aid = 2045 and tid = 2
Citation
 PubChem, PC Pyrazoline SAR compounds tested via Multiplex dose response to identify specific small molecule inhibitors of Ras and Ras-related GTPases specifically Rab2 wildtype PubChem Bioassay (2016)[AID] 
Target
Name:
Ras-related protein Rab-2A
Synonyms:
RAB2 RAB2A_CANLF | Ras-related protein Rab-2A.
Type:
Enzyme Catalytic Domain
Mol. Mass.:
23545.28
Organism:
Canis lupus familiaris
Description:
gi_46577642
Residue:
212
  
Inhibitor
Name:
BDBM54592
Synonyms:
1-(3,4-dichlorophenyl)-3,5-bis(4-methoxyphenyl)-2-pyrazoline UNM-0000305830 | cid_2829399
Type:
Small organic molecule
Emp. Form.:
C23H20Cl2N2O2
Mol. Mass.:
427.323
SMILES:
COc1ccc(cc1)C1CC(=NN1c1ccc(Cl)c(Cl)c1)c1ccc(OC)cc1
: