Target
Ras-related protein Rab-2A
Ligand
BDBM54629
Substrate
Meas. Tech.
Pyrazoline SAR compounds tested via Multiplex dose response to identify specific small molecule inhibitors of Ras and Ras-related GTPases specifically Rab2 wildtype
EC50
30000±n/a nM
Comments
Extracted from aid = 2045 and tid = 2
Citation
 PubChem, PC Pyrazoline SAR compounds tested via Multiplex dose response to identify specific small molecule inhibitors of Ras and Ras-related GTPases specifically Rab2 wildtype PubChem Bioassay (2016)[AID] 
Target
Name:
Ras-related protein Rab-2A
Synonyms:
RAB2 RAB2A_CANLF | Ras-related protein Rab-2A.
Type:
Enzyme Catalytic Domain
Mol. Mass.:
23545.28
Organism:
Canis lupus familiaris
Description:
gi_46577642
Residue:
212
  
Inhibitor
Name:
BDBM54629
Synonyms:
2-chloranyl-5-[3-(4-methoxyphenyl)-5-phenyl-3,4-dihydropyrazol-2-yl]benzoic acid 2-chloro-5-[5-(4-methoxyphenyl)-3-phenyl-2-pyrazolin-1-yl]benzoic acid cid_2951170
Type:
Small organic molecule
Emp. Form.:
C23H19ClN2O3
Mol. Mass.:
406.862
SMILES:
COc1ccc(cc1)C1CC(=NN1c1ccc(Cl)c(c1)C(O)=O)c1ccccc1
: