Target
GTPase KRas [1-37]
Ligand
BDBM41685
Substrate
Meas. Tech.
Pyrazoline SAR compounds tested via Multiplex dose response to identify specific small molecule inhibitors of Ras and Ras-related GTPases specifically Ras wildtype
EC50
30000±n/a nM
Citation
 PubChem, PC Pyrazoline SAR compounds tested via Multiplex dose response to identify specific small molecule inhibitors of Ras and Ras-related GTPases specifically Ras wildtype PubChem Bioassay (2009)[AID] 
Target
Name:
GTPase KRas [1-37]
Synonyms:
ras protein
Type:
Enzyme Catalytic Domain
Mol. Mass.:
4034.04
Organism:
Homo sapiens (Human)
Description:
gi_190938
Residue:
37
  
Inhibitor
Name:
BDBM41685
Synonyms:
4-[3-(4-bromophenyl)-5-(4-fluorophenyl)-2-pyrazolin-1-yl]benzenesulfonamide 4-[5-(4-bromophenyl)-3-(4-fluorophenyl)-3,4-dihydropyrazol-2-yl]benzenesulfonamide SMR000186920 | cid_2864688
Type:
Small organic molecule
Emp. Form.:
C21H17BrFN3O2S
Mol. Mass.:
474.346
SMILES:
NS(=O)(=O)c1ccc(cc1)N1N=C(CC1c1ccc(F)cc1)c1ccc(Br)cc1
: