Target
Ras-related C3 botulinum toxin substrate 1
Ligand
BDBM54600
Substrate
Meas. Tech.
Pyrazoline SAR compounds tested via Multiplex dose response to identify specific small molecule inhibitors of Ras and Ras-related GTPases specifically Rac1 activated mutant
EC50
30000±n/a nM
Citation
 PubChem, PC Pyrazoline SAR compounds tested via Multiplex dose response to identify specific small molecule inhibitors of Ras and Ras-related GTPases specifically Rac1 activated mutant PubChem Bioassay (2009)[AID] 
Target
Name:
Ras-related C3 botulinum toxin substrate 1
Synonyms:
RAC1_MOUSE Rac1 protein
Type:
PROTEIN
Mol. Mass.:
21455.91
Organism:
Mus musculus
Description:
EBI_101485
Residue:
192
  
Inhibitor
Name:
BDBM54600
Synonyms:
4-[2-(4-nitrophenyl)-5-phenyl-2-pyrazolin-3-yl]phenol UNM-0000305838 | cid_2848947
Type:
Small organic molecule
Emp. Form.:
C21H17N3O3
Mol. Mass.:
359.378
SMILES:
Oc1ccc(cc1)C1C[C-](N=[N+]1c1ccc(cc1)[N+]([O-])=O)c1ccccc1
: