Target
Ras-related C3 botulinum toxin substrate 1
Ligand
BDBM54617
Substrate
Meas. Tech.
Pyrazoline SAR compounds tested via Multiplex dose response to identify specific small molecule inhibitors of Ras and Ras-related GTPases specifically Rac1 activated mutant
EC50
30000±n/a nM
Citation
 PubChem, PC Pyrazoline SAR compounds tested via Multiplex dose response to identify specific small molecule inhibitors of Ras and Ras-related GTPases specifically Rac1 activated mutant PubChem Bioassay (2009)[AID] 
Target
Name:
Ras-related C3 botulinum toxin substrate 1
Synonyms:
RAC1_MOUSE Rac1 protein
Type:
PROTEIN
Mol. Mass.:
21455.91
Organism:
Mus musculus
Description:
EBI_101485
Residue:
192
  
Inhibitor
Name:
BDBM54617
Synonyms:
N,N-dimethyl-4-[2-(2-methylphenyl)-5-phenyl-3,4-dihydropyrazol-3-yl]aniline cid_2865848 | dimethyl-[4-[2-(o-tolyl)-5-phenyl-2-pyrazolin-3-yl]phenyl]amine
Type:
Small organic molecule
Emp. Form.:
C24H25N3
Mol. Mass.:
355.4754
SMILES:
CN(C)c1ccc(cc1)C1CC(=NN1c1ccccc1C)c1ccccc1
: