Target
Ras-related C3 botulinum toxin substrate 1
Ligand
BDBM54635
Substrate
Meas. Tech.
Pyrazoline SAR compounds tested via Multiplex dose response to identify specific small molecule inhibitors of Ras and Ras-related GTPases specifically Rac1 activated mutant
EC50
30000±n/a nM
Citation
 PubChem, PC Pyrazoline SAR compounds tested via Multiplex dose response to identify specific small molecule inhibitors of Ras and Ras-related GTPases specifically Rac1 activated mutant PubChem Bioassay (2009)[AID] 
Target
Name:
Ras-related C3 botulinum toxin substrate 1
Synonyms:
RAC1_MOUSE Rac1 protein
Type:
PROTEIN
Mol. Mass.:
21455.91
Organism:
Mus musculus
Description:
EBI_101485
Residue:
192
  
Inhibitor
Name:
BDBM54635
Synonyms:
4-[3-(3-fluorophenyl)-5-(4-methoxyphenyl)-2-pyrazolin-1-yl]benzenesulfonamide KUC103391N cid_42628036
Type:
Small organic molecule
Emp. Form.:
C22H20FN3O3S
Mol. Mass.:
425.476
SMILES:
COc1ccc(cc1)C1CC(=NN1c1ccc(cc1)S(N)(=O)=O)c1cccc(F)c1
: