Target
Ras-related C3 botulinum toxin substrate 1
Ligand
BDBM54672
Substrate
Meas. Tech.
Pyrazoline SAR compounds tested via Multiplex dose response to identify specific small molecule inhibitors of Ras and Ras-related GTPases specifically Rac1 activated mutant
EC50
30000±n/a nM
Citation
 PubChem, PC Pyrazoline SAR compounds tested via Multiplex dose response to identify specific small molecule inhibitors of Ras and Ras-related GTPases specifically Rac1 activated mutant PubChem Bioassay (2009)[AID] 
Target
Name:
Ras-related C3 botulinum toxin substrate 1
Synonyms:
RAC1_MOUSE Rac1 protein
Type:
PROTEIN
Mol. Mass.:
21455.91
Organism:
Mus musculus
Description:
EBI_101485
Residue:
192
  
Inhibitor
Name:
BDBM54672
Synonyms:
4-[3-(4-bromophenyl)-5-(3-methoxyphenyl)-3,4-dihydropyrazol-2-yl]benzenesulfonamide KUC103479N | cid_44216842
Type:
Small organic molecule
Emp. Form.:
C22H20BrN3O3S
Mol. Mass.:
486.382
SMILES:
COc1cccc(c1)C1=NN(C(C1)c1ccc(Br)cc1)c1ccc(cc1)S(N)(=O)=O
: