Target
Ras-related C3 botulinum toxin substrate 1
Ligand
BDBM54597
Substrate
Meas. Tech.
Pyrazoline SAR compounds tested via Multiplex dose response to identify specific small molecule inhibitors of Ras and Ras-related GTPases specifically Rac1 wildtype
EC50
30000±n/a nM
Citation
 PubChem, PC Pyrazoline SAR compounds tested via Multiplex dose response to identify specific small molecule inhibitors of Ras and Ras-related GTPases specifically Rac1 wildtype PubChem Bioassay (2009)[AID] 
Target
Name:
Ras-related C3 botulinum toxin substrate 1
Synonyms:
RAC1_MOUSE Rac1 protein
Type:
PROTEIN
Mol. Mass.:
21455.91
Organism:
Mus musculus
Description:
EBI_101485
Residue:
192
  
Inhibitor
Name:
BDBM54597
Synonyms:
1-(m-tolyl)-3,5-diphenyl-2-pyrazoline UNM-0000305835 | cid_2841247
Type:
Small organic molecule
Emp. Form.:
C22H20N2
Mol. Mass.:
312.4076
SMILES:
Cc1cccc(c1)N1N=C(CC1c1ccccc1)c1ccccc1
: