Target
Ras-related C3 botulinum toxin substrate 1
Ligand
BDBM54609
Substrate
Meas. Tech.
Pyrazoline SAR compounds tested via Multiplex dose response to identify specific small molecule inhibitors of Ras and Ras-related GTPases specifically Rac1 wildtype
EC50
30000±n/a nM
Citation
 PubChem, PC Pyrazoline SAR compounds tested via Multiplex dose response to identify specific small molecule inhibitors of Ras and Ras-related GTPases specifically Rac1 wildtype PubChem Bioassay (2009)[AID] 
Target
Name:
Ras-related C3 botulinum toxin substrate 1
Synonyms:
RAC1_MOUSE Rac1 protein
Type:
PROTEIN
Mol. Mass.:
21455.91
Organism:
Mus musculus
Description:
EBI_101485
Residue:
192
  
Inhibitor
Name:
BDBM54609
Synonyms:
4-[5-(4-chlorophenyl)-2-phenyl-3,4-dihydropyrazol-3-yl]-N,N-dimethyl-aniline UNM-0000305847 cid_2861640
Type:
Small organic molecule
Emp. Form.:
C23H22ClN3
Mol. Mass.:
375.894
SMILES:
CN(C)c1ccc(cc1)C1CC(=NN1c1ccccc1)c1ccc(Cl)cc1
: