Target
Tyrosine-protein phosphatase non-receptor type 7
Ligand
BDBM31739
Substrate
Meas. Tech.
MOA HePTP Fluorescent secondary assay for identification of redox-state modulating compounds
IC50
2650±n/a nM
Citation
 PubChem, PC MOA HePTP Fluorescent secondary assay for identification of redox-state modulating compounds PubChem Bioassay (2009)[AID] 
Target
Name:
Tyrosine-protein phosphatase non-receptor type 7
Synonyms:
He-PTP Hematopoietic protein-tyrosine phosphatase (HEPTP) PTPN7 Tyrosine-protein phosphatase non-receptor type 7 | Tyrosine-protein phosphatase non-receptor type 7 (HEPTP)
Type:
Protein
Mol. Mass.:
40530.79
Organism:
Homo sapiens (Human)
Description:
P35236
Residue:
360
  
Inhibitor
Name:
BDBM31739
Synonyms:
2-[5-[(E)-(1-keto-6,7-dimethyl-thiazolo[3,2-a]benzimidazol-2-ylidene)methyl]-2-furyl]benzoic acid 2-[5-[(E)-(6,7-dimethyl-1-oxo-2-thiazolo[3,2-a]benzimidazolylidene)methyl]-2-furanyl]benzoic acid MLS-0091949.0001 | cid_2173774
Type:
Small organic molecule
Emp. Form.:
C23H16N2O4S
Mol. Mass.:
416.449
SMILES:
Cc1cc2nc3s\c(=C\c4ccc(o4)-c4ccccc4C(O)=O)c(=O)n3c2cc1C
: