Target
Dual specificity protein phosphatase 3
Ligand
BDBM31759
Substrate
Meas. Tech.
MOA VHR1 Fluorescent secondary assay for identification of redox-state modulating compounds
IC50
308±n/a nM
Citation
 PubChem, PC MOA VHR1 Fluorescent secondary assay for identification of redox-state modulating compounds PubChem Bioassay (2009)[AID] 
Target
Name:
Dual specificity protein phosphatase 3
Synonyms:
DUS3_HUMAN Dual specificity protein phosphatase (VHR) Dual specificity protein phosphatase VHR Tyrosine-protein phosphatase non-receptor type 1 | VHR
Type:
Hydrolase
Mol. Mass.:
20480.58
Organism:
Homo sapiens (Human)
Description:
Residue:
185
  
Inhibitor
Name:
BDBM31759
Synonyms:
2-[5-[(Z)-(3-bromanyl-8-oxidanylidene-[1,3]thiazolo[4,5]imidazo[1,2-b]pyridin-7-ylidene)methyl]furan-2-yl]benzoic acid 2-[5-[(Z)-(3-bromo-8-oxo-7-thiazolo[4,5]imidazo[1,2-b]pyridinylidene)methyl]-2-furanyl]benzoic acid MLS-0090801.0001 | cid_1357397
Type:
Small organic molecule
Emp. Form.:
C20H10BrN3O4S
Mol. Mass.:
468.28
SMILES:
OC(=O)c1ccccc1-c1ccc(\C=c2/sc3nc4cc(Br)cnc4n3c2=O)o1
: