Target
Isoform Bcl-X(L) of Bcl-2-like protein 1 (Bcl-xL)
Ligand
BDBM32266
Substrate
Meas. Tech.
Confirmation dose response of hits from multiplexed high-throughput screen for small molecule regulators of Bcl-2 family protein interactions, specifically Bim-Bcl-XL
EC50
18360±n/a nM
Citation
 PubChem, PC Confirmation dose response of hits from multiplexed high-throughput screen for small molecule regulators of Bcl-2 family protein interactions, specifically Bim-Bcl-XL PubChem Bioassay (2009)[AID] 
Target
Name:
Isoform Bcl-X(L) of Bcl-2-like protein 1 (Bcl-xL)
Synonyms:
B-cell lymphoma-extra large protein (Bcl-xL) BCL-xL BCL2L1 Bcl-2-like protein 1 (Bcl-xL) | Isoform Bcl-X(L)
Type:
Homodimers/heterodimers with BAX, BAK and BCL2
Mol. Mass.:
26053.63
Organism:
Homo sapiens (Human)
Description:
gi_510901
Residue:
233
  
Inhibitor
Name:
BDBM32266
Synonyms:
2,3-bis(2-furyl)-N-homoveratryl-quinoxaline-6-carboxamide N-[2-(3,4-dimethoxyphenyl)ethyl]-2,3-bis(2-furanyl)-6-quinoxalinecarboxamide N-[2-(3,4-dimethoxyphenyl)ethyl]-2,3-di-2-furylquinoxaline-6-carboxamide cid_3238500
Type:
Small organic molecule
Emp. Form.:
C27H23N3O5
Mol. Mass.:
469.4886
SMILES:
COc1ccc(CCNC(=O)c2ccc3nc(-c4ccco4)c(nc3c2)-c2ccco2)cc1OC
: