Target
Amyloid-beta A4 precursor protein-binding family A member 1
Ligand
BDBM34207
Substrate
Meas. Tech.
uHTS Homogeneous Terbium Time-Resolved Fluorescence Resonance Energy Transfer (HTRF) Assay
IC50
3170±n/a nM
Citation
 PubChem, PC uHTS Homogeneous Terbium Time-Resolved Fluorescence Resonance Energy Transfer (HTRF) Assay PubChem Bioassay (2009)[AID] 
Target
Name:
Amyloid-beta A4 precursor protein-binding family A member 1
Synonyms:
APBA1_RAT Mint1 neuronal munc18-1 binding protein
Type:
Enzyme Catalytic Domain
Mol. Mass.:
92603.32
Organism:
Rattus norvegicus
Description:
gi_2625023
Residue:
839
  
Inhibitor
Name:
BDBM34207
Synonyms:
3-({Cyclohexyl-[1-(1-furan-2-ylmethyl-1H-tetrazol-5-yl)-2-methyl-propyl]-amino}-methyl)-6-methoxy-1H-quinolin-2-one 3-[[cyclohexyl-[1-[1-(2-furfuryl)tetrazol-5-yl]-2-methyl-propyl]amino]methyl]-6-methoxy-carbostyril 3-[[cyclohexyl-[1-[1-(furan-2-ylmethyl)tetrazol-5-yl]-2-methylpropyl]amino]methyl]-6-methoxy-1H-quinolin-2-one SMR000004514 | cid_650199
Type:
Small organic molecule
Emp. Form.:
C27H34N6O3
Mol. Mass.:
490.5973
SMILES:
COc1ccc2[nH]c(=O)c(CN(C(C(C)C)c3nnnn3Cc3ccco3)C3CCCCC3)cc2c1
: