Target
Amyloid-beta A4 precursor protein-binding family A member 1
Ligand
BDBM39932
Substrate
Meas. Tech.
uHTS Homogeneous Terbium Time-Resolved Fluorescence Resonance Energy Transfer (HTRF) Assay
IC50
1980±n/a nM
Citation
 PubChem, PC uHTS Homogeneous Terbium Time-Resolved Fluorescence Resonance Energy Transfer (HTRF) Assay PubChem Bioassay (2009)[AID] 
Target
Name:
Amyloid-beta A4 precursor protein-binding family A member 1
Synonyms:
APBA1_RAT Mint1 neuronal munc18-1 binding protein
Type:
Enzyme Catalytic Domain
Mol. Mass.:
92603.32
Organism:
Rattus norvegicus
Description:
gi_2625023
Residue:
839
  
Inhibitor
Name:
BDBM39932
Synonyms:
MLS000082573 cid_665043
Type:
Small organic molecule
Emp. Form.:
C21H22N4O3S2
Mol. Mass.:
442.554
SMILES:
CSc1nc(NCCOCCO)c2sc3nc(c4CCCc4c3c2n1)-c1ccco1
: