Target
Amyloid-beta A4 precursor protein-binding family A member 1
Ligand
BDBM46177
Substrate
Meas. Tech.
uHTS Homogeneous Terbium Time-Resolved Fluorescence Resonance Energy Transfer (HTRF) Assay
IC50
2280±n/a nM
Citation
 PubChem, PC uHTS Homogeneous Terbium Time-Resolved Fluorescence Resonance Energy Transfer (HTRF) Assay PubChem Bioassay (2009)[AID] 
Target
Name:
Amyloid-beta A4 precursor protein-binding family A member 1
Synonyms:
APBA1_RAT Mint1 neuronal munc18-1 binding protein
Type:
Enzyme Catalytic Domain
Mol. Mass.:
92603.32
Organism:
Rattus norvegicus
Description:
gi_2625023
Residue:
839
  
Inhibitor
Name:
BDBM46177
Synonyms:
MLS-0054638.0001 N-cyclopentyl-2,3-bis(2-furyl)quinoxaline-6-carboxamide cid_3236343
Type:
Small organic molecule
Emp. Form.:
C22H19N3O3
Mol. Mass.:
373.4046
SMILES:
O=C(NC1CCCC1)c1ccc2nc(-c3ccco3)c(nc2c1)-c1ccco1
: