Target
Amyloid-beta A4 precursor protein-binding family A member 1
Ligand
BDBM33049
Substrate
Meas. Tech.
uHTS Homogeneous Terbium Time-Resolved Fluorescence Resonance Energy Transfer (HTRF) Assay
IC50
6420±n/a nM
Citation
 PubChem, PC uHTS Homogeneous Terbium Time-Resolved Fluorescence Resonance Energy Transfer (HTRF) Assay PubChem Bioassay (2009)[AID] 
Target
Name:
Amyloid-beta A4 precursor protein-binding family A member 1
Synonyms:
APBA1_RAT Mint1 neuronal munc18-1 binding protein
Type:
Enzyme Catalytic Domain
Mol. Mass.:
92603.32
Organism:
Rattus norvegicus
Description:
gi_2625023
Residue:
839
  
Inhibitor
Name:
BDBM33049
Synonyms:
(4-chlorodithiazol-5-ylidene)-(3,5-dimethoxyphenyl)amine 4-chloro-N-(3,5-dimethoxyphenyl)-5-dithiazolimine MLS000044018 SMR000021429 | cid_715724
Type:
Small organic molecule
Emp. Form.:
C10H9ClN2O2S2
Mol. Mass.:
288.774
SMILES:
COc1cc(OC)cc(c1)\N=c1\ssnc1Cl
: