Target
Amyloid-beta A4 precursor protein-binding family A member 1
Ligand
BDBM54730
Substrate
Meas. Tech.
uHTS Homogeneous Terbium Time-Resolved Fluorescence Resonance Energy Transfer (HTRF) Assay
IC50
41500±n/a nM
Citation
 PubChem, PC uHTS Homogeneous Terbium Time-Resolved Fluorescence Resonance Energy Transfer (HTRF) Assay PubChem Bioassay (2009)[AID] 
Target
Name:
Amyloid-beta A4 precursor protein-binding family A member 1
Synonyms:
APBA1_RAT Mint1 neuronal munc18-1 binding protein
Type:
Enzyme Catalytic Domain
Mol. Mass.:
92603.32
Organism:
Rattus norvegicus
Description:
gi_2625023
Residue:
839
  
Inhibitor
Name:
BDBM54730
Synonyms:
(E)-3-(1,3-benzodioxol-5-yl)-N-(6-methoxy-1,3-benzothiazol-2-yl)-2-propenamide (E)-3-(1,3-benzodioxol-5-yl)-N-(6-methoxy-1,3-benzothiazol-2-yl)prop-2-enamide SMR000195585 | cid_1345038
Type:
Small organic molecule
Emp. Form.:
C18H14N2O4S
Mol. Mass.:
354.38
SMILES:
COc1ccc2nc(NC(=O)\C=C\c3ccc4OCOc4c3)sc2c1
: