Target
Amyloid-beta A4 precursor protein-binding family A member 1
Ligand
BDBM54732
Substrate
Meas. Tech.
uHTS Homogeneous Terbium Time-Resolved Fluorescence Resonance Energy Transfer (HTRF) Assay
IC50
42100±n/a nM
Citation
 PubChem, PC uHTS Homogeneous Terbium Time-Resolved Fluorescence Resonance Energy Transfer (HTRF) Assay PubChem Bioassay (2009)[AID] 
Target
Name:
Amyloid-beta A4 precursor protein-binding family A member 1
Synonyms:
APBA1_RAT Mint1 neuronal munc18-1 binding protein
Type:
Enzyme Catalytic Domain
Mol. Mass.:
92603.32
Organism:
Rattus norvegicus
Description:
gi_2625023
Residue:
839
  
Inhibitor
Name:
BDBM54732
Synonyms:
5-[(2-hydroxy-6-methyl-3-quinolinyl)methylene]-2-thioxodihydro-4,6(1H,5H)-pyrimidinedione 5-[(6-methyl-2-oxidanylidene-1H-quinolin-3-yl)methylidene]-2-sulfanylidene-1,3-diazinane-4,6-dione MLS000575883 cid_5397113
Type:
Small organic molecule
Emp. Form.:
C15H11N3O3S
Mol. Mass.:
313.331
SMILES:
Cc1ccc2[nH]c(=O)c(C=C3C(=O)NC(=S)NC3=O)cc2c1
: