Target
Amyloid-beta A4 precursor protein-binding family A member 1
Ligand
BDBM33178
Substrate
Meas. Tech.
uHTS Homogeneous Terbium Time-Resolved Fluorescence Resonance Energy Transfer (HTRF) Assay
IC50
4160±n/a nM
Citation
 PubChem, PC uHTS Homogeneous Terbium Time-Resolved Fluorescence Resonance Energy Transfer (HTRF) Assay PubChem Bioassay (2009)[AID] 
Target
Name:
Amyloid-beta A4 precursor protein-binding family A member 1
Synonyms:
APBA1_RAT Mint1 neuronal munc18-1 binding protein
Type:
Enzyme Catalytic Domain
Mol. Mass.:
92603.32
Organism:
Rattus norvegicus
Description:
gi_2625023
Residue:
839
  
Inhibitor
Name:
BDBM33178
Synonyms:
(4-bromophenyl)-(4-chlorodithiazol-5-ylidene)amine N-(4-bromophenyl)-4-chloranyl-1,2,3-dithiazol-5-imine N-(4-bromophenyl)-4-chlorodithiazol-5-imine SMR000307180 | cid_715703
Type:
Small organic molecule
Emp. Form.:
C8H4BrClN2S2
Mol. Mass.:
307.618
SMILES:
Clc1nss\c1=N/c1ccc(Br)cc1
: