Target
Amyloid-beta A4 precursor protein-binding family A member 1
Ligand
BDBM50612
Substrate
Meas. Tech.
uHTS Homogeneous Terbium Time-Resolved Fluorescence Resonance Energy Transfer (HTRF) Assay
IC50
260±n/a nM
Citation
 PubChem, PC uHTS Homogeneous Terbium Time-Resolved Fluorescence Resonance Energy Transfer (HTRF) Assay PubChem Bioassay (2009)[AID] 
Target
Name:
Amyloid-beta A4 precursor protein-binding family A member 1
Synonyms:
APBA1_RAT Mint1 neuronal munc18-1 binding protein
Type:
Enzyme Catalytic Domain
Mol. Mass.:
92603.32
Organism:
Rattus norvegicus
Description:
gi_2625023
Residue:
839
  
Inhibitor
Name:
BDBM50612
Synonyms:
2,2-Dimethyl-5-nitro-2H-benzoimidazole 1,3-dioxide 2,2-dimethyl-5-nitro-3-oxidobenzimidazol-1-ium 1-oxide;hydroxylamine SMR000426911 cid_16682085
Type:
Small organic molecule
Emp. Form.:
C9H9N3O4
Mol. Mass.:
223.1855
SMILES:
CC1(C)N([O-])c2cc(ccc2[N+]1=O)[N+]([O-])=O
: