Target
Amyloid-beta A4 precursor protein-binding family A member 1
Ligand
BDBM54761
Substrate
Meas. Tech.
uHTS Homogeneous Terbium Time-Resolved Fluorescence Resonance Energy Transfer (HTRF) Assay
IC50
1130±n/a nM
Citation
 PubChem, PC uHTS Homogeneous Terbium Time-Resolved Fluorescence Resonance Energy Transfer (HTRF) Assay PubChem Bioassay (2009)[AID] 
Target
Name:
Amyloid-beta A4 precursor protein-binding family A member 1
Synonyms:
APBA1_RAT Mint1 neuronal munc18-1 binding protein
Type:
Enzyme Catalytic Domain
Mol. Mass.:
92603.32
Organism:
Rattus norvegicus
Description:
gi_2625023
Residue:
839
  
Inhibitor
Name:
BDBM54761
Synonyms:
3-(2-thienylsulfonyl)pyrazine-2-carbonitrile 3-thiophen-2-ylsulfonyl-2-pyrazinecarbonitrile MLS000860740 cid_2821421
Type:
Small organic molecule
Emp. Form.:
C9H5N3O2S2
Mol. Mass.:
251.285
SMILES:
O=S(=O)(c1cccs1)c1nccnc1C#N
: