Target
Kappa-type opioid receptor
Ligand
BDBM54783
Substrate
Meas. Tech.
HTS Image-Based Screen for Selective Agonists of the KOR Receptor
EC50
4267.878±n/a nM
Citation
 PubChem, PC HTS Image-Based Screen for Selective Agonists of the KOR Receptor PubChem Bioassay (2009)[AID] 
Target
Name:
Kappa-type opioid receptor
Synonyms:
K-OR-1 Kappa-opioid receptor (KOR) Kappa-type opioid receptor (KOR) OPIATE Kappa OPRK1 kappa opioid receptor (KOR)
Type:
G Protein-Coupled Receptor (GPCR)
Mol. Mass.:
42648.76
Organism:
Homo sapiens (Human)
Description:
P41145
Residue:
380
  
Inhibitor
Name:
BDBM54783
Synonyms:
MLS000551700 N-butyl-N-[(2-oxidanylidene-1H-quinolin-3-yl)methyl]pyridine-2-carboxamide N-butyl-N-[(2-oxo-1H-quinolin-3-yl)methyl]pyridine-2-carboxamide SMR000145625 | cid_4376926
Type:
Small organic molecule
Emp. Form.:
C20H21N3O2
Mol. Mass.:
335.3996
SMILES:
CCCCN(Cc1cc2ccccc2[nH]c1=O)C(=O)c1ccccn1
: