Target
Kappa-type opioid receptor
Ligand
BDBM54785
Substrate
Meas. Tech.
HTS Image-Based Screen for Selective Agonists of the KOR Receptor
EC50
1860.459±n/a nM
Citation
 PubChem, PC HTS Image-Based Screen for Selective Agonists of the KOR Receptor PubChem Bioassay (2009)[AID] 
Target
Name:
Kappa-type opioid receptor
Synonyms:
K-OR-1 Kappa-opioid receptor (KOR) Kappa-type opioid receptor (KOR) OPIATE Kappa OPRK1 kappa opioid receptor (KOR)
Type:
G Protein-Coupled Receptor (GPCR)
Mol. Mass.:
42648.76
Organism:
Homo sapiens (Human)
Description:
P41145
Residue:
380
  
Inhibitor
Name:
BDBM54785
Synonyms:
MLS000729763 N-[1-(cyclopentylamino)-2-methyl-1-oxobutan-2-yl]-N-(thiophen-2-ylmethyl)-2-pyridinecarboxamide N-[1-(cyclopentylcarbamoyl)-1-methyl-propyl]-N-(2-thenyl)picolinamide Structure possibly contains amino acid derivative which is not supported in current version! | cid_3950572
Type:
Small organic molecule
Emp. Form.:
C21H27N3O2S
Mol. Mass.:
385.523
SMILES:
CCC(C)(N(Cc1cccs1)C(=O)c1ccccn1)C(=O)NC1CCCC1
: