Target
Tyrosine-protein phosphatase non-receptor type 22
Ligand
BDBM46235
Substrate
Meas. Tech.
SAR LYP1 Fluorescent Assay using pCAP substrate for In Vitro dose response studies
IC50
2661±n/a nM
Citation
 PubChem, PC SAR LYP1 Fluorescent Assay using pCAP substrate for In Vitro dose response studies PubChem Bioassay (2009)[AID] 
Target
Name:
Tyrosine-protein phosphatase non-receptor type 22
Synonyms:
3.1.3.48 LyP Lymphoid phosphatase (Lyp) PEST-domain phosphatase PTPN22 Tyrosine-protein phosphatase non-receptor type 22 (LYP) | tyrosine-protein phosphatase non-receptor type 22 isoform 1
Type:
Mol. Mass.:
91712.31
Organism:
Homo sapiens (Human)
Description:
Q9Y2R2
Residue:
807
  
Inhibitor
Name:
BDBM46235
Synonyms:
4-[[2-bromanyl-4-[(E)-2-cyano-2-(3-fluorophenyl)ethenyl]phenoxy]methyl]benzoic acid 4-[[2-bromo-4-[(E)-2-cyano-2-(3-fluorophenyl)vinyl]phenoxy]methyl]benzoic acid cid_2229326
Type:
Small organic molecule
Emp. Form.:
C23H15BrFNO3
Mol. Mass.:
452.273
SMILES:
OC(=O)c1ccc(COc2ccc(\C=C(\C#N)c3cccc(F)c3)cc2Br)cc1
: