Target
Kappa-type opioid receptor
Ligand
BDBM54811
Substrate
Meas. Tech.
HTS Image-Based Screen for Selective Antagonists of the KOR Receptor
IC50
3552±473 nM
Citation
 PubChem, PC HTS Image-Based Screen for Selective Antagonists of the KOR Receptor PubChem Bioassay (2009)[AID] 
Target
Name:
Kappa-type opioid receptor
Synonyms:
K-OR-1 Kappa-opioid receptor (KOR) Kappa-type opioid receptor (KOR) OPIATE Kappa OPRK1 kappa opioid receptor (KOR)
Type:
G Protein-Coupled Receptor (GPCR)
Mol. Mass.:
42648.76
Organism:
Homo sapiens (Human)
Description:
P41145
Residue:
380
  
Inhibitor
Name:
BDBM54811
Synonyms:
7-chloranyl-3-phenyl-[1,3]thiazolo[4,5-d]pyrimidine-2-thione 7-chloro-3-phenyl-[1,3]thiazolo[4,5-d]pyrimidine-2-thione 7-chloro-3-phenyl[1,3]thiazolo[4,5-d]pyrimidine-2(3H)-thione SMR000306339 | cid_373692
Type:
Small organic molecule
Emp. Form.:
C11H6ClN3S2
Mol. Mass.:
279.768
SMILES:
Clc1ncnc2n(-c3ccccc3)c(=S)sc12
: