Target
Kappa-type opioid receptor
Ligand
BDBM54837
Substrate
Meas. Tech.
HTS Image-Based Screen for Selective Antagonists of the KOR Receptor
IC50
6164±657 nM
Citation
 PubChem, PC HTS Image-Based Screen for Selective Antagonists of the KOR Receptor PubChem Bioassay (2009)[AID] 
Target
Name:
Kappa-type opioid receptor
Synonyms:
K-OR-1 Kappa-opioid receptor (KOR) Kappa-type opioid receptor (KOR) OPIATE Kappa OPRK1 kappa opioid receptor (KOR)
Type:
G Protein-Coupled Receptor (GPCR)
Mol. Mass.:
42648.76
Organism:
Homo sapiens (Human)
Description:
P41145
Residue:
380
  
Inhibitor
Name:
BDBM54837
Synonyms:
2-(1,2-dimethyl-3-indolyl)-N-[3-[4-(4-methoxyphenyl)-1-piperazinyl]propyl]-2-oxoacetamide 2-(1,2-dimethylindol-3-yl)-N-[3-[4-(4-methoxyphenyl)piperazin-1-yl]propyl]-2-oxidanylidene-ethanamide MLS001076864 cid_16800789
Type:
Small organic molecule
Emp. Form.:
C26H32N4O3
Mol. Mass.:
448.5573
SMILES:
COc1ccc(cc1)N1CCN(CCCNC(=O)C(=O)c2c(C)n(C)c3ccccc23)CC1
: