Target
Tyrosine-protein phosphatase non-receptor type 22
Ligand
BDBM54792
Substrate
Meas. Tech.
SAR LYP1 Fluorescent Assay using OMFP substrate for In Vitro dose response studies
IC50
>200000±n/a nM
Citation
 PubChem, PC SAR LYP1 Fluorescent Assay using OMFP substrate for In Vitro dose response studies PubChem Bioassay (2009)[AID] 
Target
Name:
Tyrosine-protein phosphatase non-receptor type 22
Synonyms:
3.1.3.48 LyP Lymphoid phosphatase (Lyp) PEST-domain phosphatase PTPN22 Tyrosine-protein phosphatase non-receptor type 22 (LYP) | tyrosine-protein phosphatase non-receptor type 22 isoform 1
Type:
Mol. Mass.:
91712.31
Organism:
Homo sapiens (Human)
Description:
Q9Y2R2
Residue:
807
  
Inhibitor
Name:
BDBM54792
Synonyms:
2-(3-cyano-5,8-dimethyl-quinolin-2-yl)sulfanyl-N-(2-ethyl-6-methyl-phenyl)ethanamide 2-[(3-cyano-5,8-dimethyl-2-quinolinyl)thio]-N-(2-ethyl-6-methylphenyl)acetamide CHEMBL1713374 cid_1450182
Type:
Small organic molecule
Emp. Form.:
C23H23N3OS
Mol. Mass.:
389.513
SMILES:
CCc1cccc(C)c1NC(=O)CSc1nc2c(C)ccc(C)c2cc1C#N
: