Target
Plectin
Ligand
BDBM54906
Substrate
Meas. Tech.
HTS TR-FRET-based dose response confirmatory assay for Siah-1
IC50
2391.074±714 nM
Citation
 PubChem, PC HTS TR-FRET-based dose response confirmatory assay for Siah-1 PubChem Bioassay (2009)[AID] 
Target
Name:
Plectin
Synonyms:
PLEC PLEC_HUMAN | plectin 1
Type:
Enzyme Catalytic Domain
Mol. Mass.:
531740.96
Organism:
Homo sapiens (Human)
Description:
Q15149
Residue:
4684
  
Inhibitor
Name:
BDBM54906
Synonyms:
MLS000100703 N-[4-(2-oxidanylidenechromen-3-yl)-1,3-thiazol-2-yl]furan-2-carboxamide N-[4-(2-oxochromen-3-yl)-1,3-thiazol-2-yl]furan-2-carboxamide cid_2054987
Type:
Small organic molecule
Emp. Form.:
C17H10N2O4S
Mol. Mass.:
338.337
SMILES:
O=C(Nc1nc(cs1)-c1cc2ccccc2oc1=O)c1ccco1
: