Target
Plectin
Ligand
BDBM54922
Substrate
Meas. Tech.
HTS TR-FRET-based dose response confirmatory assay for Siah-1
IC50
4266±997 nM
Citation
 PubChem, PC HTS TR-FRET-based dose response confirmatory assay for Siah-1 PubChem Bioassay (2009)[AID] 
Target
Name:
Plectin
Synonyms:
PLEC PLEC_HUMAN | plectin 1
Type:
Enzyme Catalytic Domain
Mol. Mass.:
531740.96
Organism:
Homo sapiens (Human)
Description:
Q15149
Residue:
4684
  
Inhibitor
Name:
BDBM54922
Synonyms:
4-[1,3-bis(oxidanylidene)-3a,4,7,7a-tetrahydroisoindol-2-yl]-N-(4-bromophenyl)benzamide N-(4-bromophenyl)-4-(1,3-diketo-3a,4,7,7a-tetrahydroisoindol-2-yl)benzamide N-(4-bromophenyl)-4-(1,3-dioxo-3a,4,7,7a-tetrahydroisoindol-2-yl)benzamide cid_2933296
Type:
Small organic molecule
Emp. Form.:
C21H17BrN2O3
Mol. Mass.:
425.275
SMILES:
Oc1c2CC=CCc2c(O)n1-c1ccc(cc1)C(=O)Nc1ccc(Br)cc1
: