Target
Plectin
Ligand
BDBM54940
Substrate
Meas. Tech.
HTS TR-FRET-based dose response confirmatory assay for Siah-1
IC50
167613.9±115000 nM
Citation
 PubChem, PC HTS TR-FRET-based dose response confirmatory assay for Siah-1 PubChem Bioassay (2009)[AID] 
Target
Name:
Plectin
Synonyms:
PLEC PLEC_HUMAN | plectin 1
Type:
Enzyme Catalytic Domain
Mol. Mass.:
531740.96
Organism:
Homo sapiens (Human)
Description:
Q15149
Residue:
4684
  
Inhibitor
Name:
BDBM54940
Synonyms:
3-[4-[(2-fluorobenzoyl)amino]phenoxy]-2-thenoic acid 3-[4-[(2-fluorophenyl)carbonylamino]phenoxy]thiophene-2-carboxylic acid 3-{4-[(2-fluorobenzoyl)amino]phenoxy}-2-thiophenecarboxylic acid SMR000550385 | cid_16413328
Type:
Small organic molecule
Emp. Form.:
C18H12FNO4S
Mol. Mass.:
357.356
SMILES:
OC(=O)c1sccc1Oc1ccc(NC(=O)c2ccccc2F)cc1
: