Target
Mitogen-activated protein kinase kinase kinase 3
Ligand
BDBM54953
Substrate
Meas. Tech.
SAR Compounds tested by Dose Response Screen via Multiplex HTS Assay for Inhibitors of MEK Kinase PB1 Domains, specifically MEK5 binding to MEK Kinase 3 Wildtype.
EC50
>30000±n/a nM
Citation
 PubChem, PC SAR Compounds tested by Dose Response Screen via Multiplex HTS Assay for Inhibitors of MEK Kinase PB1 Domains, specifically MEK5 binding to MEK Kinase 3 Wildtype. PubChem Bioassay (2009)[AID] 
Target
Name:
Mitogen-activated protein kinase kinase kinase 3
Synonyms:
M3K3_HUMAN MAPKKK3 Mitogen-activated protein kinase kinase kinase 3 | mitogen-activated protein kinase kinase kinase 3 isoform 1
Type:
PROTEIN
Mol. Mass.:
70916.05
Organism:
Homo sapiens (Human)
Description:
ChEMBL_774345
Residue:
626
  
Inhibitor
Name:
BDBM54953
Synonyms:
3-(2-furanyl)-6-(2-methoxy-4-nitrophenyl)-[1,2,4]triazolo[3,4-b][1,3,4]thiadiazole 3-(furan-2-yl)-6-(2-methoxy-4-nitro-phenyl)-[1,2,4]triazolo[3,4-b][1,3,4]thiadiazole VU0364703-1 | cid_44236876
Type:
Small organic molecule
Emp. Form.:
C14H9N5O4S
Mol. Mass.:
343.317
SMILES:
COc1cc(ccc1-c1nn2c(nnc2s1)-c1ccco1)[N+]([O-])=O
: