Target
Mitogen-activated protein kinase kinase kinase kinase 2
Ligand
BDBM54950
Substrate
Meas. Tech.
SAR Compounds tested by Dose Response Screen via Multiplex HTS Assay for Inhibitors of MEK Kinase PB1 Domains, specifically MEK5 binding to MEK Kinase 2 Mutant.
EC50
>30000±n/a nM
Citation
 PubChem, PC SAR Compounds tested by Dose Response Screen via Multiplex HTS Assay for Inhibitors of MEK Kinase PB1 Domains, specifically MEK5 binding to MEK Kinase 2 Mutant. PubChem Bioassay (2009)[AID] 
Target
Name:
Mitogen-activated protein kinase kinase kinase kinase 2
Synonyms:
2.7.11.1 GC kinase Germinal center kinase MAP4K2 MEK kinase kinase 2 RAB8IP | Rab8-interacting protein
Type:
Mol. Mass.:
91551.35
Organism:
Homo sapiens (Human)
Description:
Residue:
820
  
Inhibitor
Name:
BDBM54950
Synonyms:
6-cyclohexyl-3-(2-furanyl)-[1,2,4]triazolo[3,4-b][1,3,4]thiadiazole 6-cyclohexyl-3-(furan-2-yl)-[1,2,4]triazolo[3,4-b][1,3,4]thiadiazole cid_663145
Type:
Small organic molecule
Emp. Form.:
C13H14N4OS
Mol. Mass.:
274.341
SMILES:
C1CCC(CC1)c1nn2c(nnc2s1)-c1ccco1
: