Target
Core protein
Ligand
BDBM54973
Substrate
Meas. Tech.
TR-FRET-based biochemical high-throughput dose response assay to identify inhibitors of Hepatitis C Virus (HCV) core protein dimerization.
IC50
>49751±n/a nM
Citation
 PubChem, PC TR-FRET-based biochemical high-throughput dose response assay to identify inhibitors of Hepatitis C Virus (HCV) core protein dimerization. PubChem Bioassay (2009)[AID] 
Target
Name:
Core protein
Synonyms:
Type:
Enzyme Catalytic Domain
Mol. Mass.:
14237.71
Organism:
Hepatitis C virus
Description:
gi_83779224
Residue:
126
  
Inhibitor
Name:
BDBM54973
Synonyms:
5-(cyclopentanecarbonylthiocarbamoylamino)-3-methyl-thiophene-2-carboxylic acid ethyl ester MLS000392613 cid_2375640 ethyl 5-(cyclopentylcarbonylcarbamothioylamino)-3-methyl-thiophene-2-carboxylate
Type:
Small organic molecule
Emp. Form.:
C15H20N2O3S2
Mol. Mass.:
340.461
SMILES:
CCOC(=O)c1sc(NC(=S)NC(=O)C2CCCC2)cc1C
: