Target
Core protein
Ligand
BDBM48751
Substrate
Meas. Tech.
TR-FRET-based biochemical high-throughput dose response assay to identify inhibitors of Hepatitis C Virus (HCV) core protein dimerization.
IC50
>49751±n/a nM
Citation
 PubChem, PC TR-FRET-based biochemical high-throughput dose response assay to identify inhibitors of Hepatitis C Virus (HCV) core protein dimerization. PubChem Bioassay (2009)[AID] 
Target
Name:
Core protein
Synonyms:
Type:
Enzyme Catalytic Domain
Mol. Mass.:
14237.71
Organism:
Hepatitis C virus
Description:
gi_83779224
Residue:
126
  
Inhibitor
Name:
BDBM48751
Synonyms:
2-(2-furanyl)-N-(2-thiazolyl)-4-quinolinecarboxamide 2-(furan-2-yl)-N-(1,3-thiazol-2-yl)quinoline-4-carboxamide SMR000256130 | cid_2082785
Type:
Small organic molecule
Emp. Form.:
C17H11N3O2S
Mol. Mass.:
321.353
SMILES:
O=C(Nc1nccs1)c1cc(nc2ccccc12)-c1ccco1
: