Target
Core protein
Ligand
BDBM54980
Substrate
Meas. Tech.
TR-FRET-based biochemical high-throughput dose response assay to identify inhibitors of Hepatitis C Virus (HCV) core protein dimerization.
IC50
>49751±n/a nM
Citation
 PubChem, PC TR-FRET-based biochemical high-throughput dose response assay to identify inhibitors of Hepatitis C Virus (HCV) core protein dimerization. PubChem Bioassay (2009)[AID] 
Target
Name:
Core protein
Synonyms:
Type:
Enzyme Catalytic Domain
Mol. Mass.:
14237.71
Organism:
Hepatitis C virus
Description:
gi_83779224
Residue:
126
  
Inhibitor
Name:
BDBM54980
Synonyms:
6-chloranyl-9-nitro-4-pyridin-2-yl-3a,4,5,9b-tetrahydro-3H-cyclopenta[c]quinoline 6-chloro-9-nitro-4-(2-pyridyl)-3a,4,5,9b-tetrahydro-3H-cyclopenta[c]quinoline MLS000708763 cid_3154395
Type:
Small organic molecule
Emp. Form.:
C17H14ClN3O2
Mol. Mass.:
327.765
SMILES:
[O-][N+](=O)c1ccc(Cl)c2NC(C3CC=CC3c12)c1ccccn1
: