Target
Core protein
Ligand
BDBM51295
Substrate
Meas. Tech.
TR-FRET-based biochemical high-throughput dose response assay to identify inhibitors of Hepatitis C Virus (HCV) core protein dimerization.
IC50
>49751±n/a nM
Citation
 PubChem, PC TR-FRET-based biochemical high-throughput dose response assay to identify inhibitors of Hepatitis C Virus (HCV) core protein dimerization. PubChem Bioassay (2009)[AID] 
Target
Name:
Core protein
Synonyms:
Type:
Enzyme Catalytic Domain
Mol. Mass.:
14237.71
Organism:
Hepatitis C virus
Description:
gi_83779224
Residue:
126
  
Inhibitor
Name:
BDBM51295
Synonyms:
8-Amino-2-thioxo-2,3-dihydro-1H-benzo[g]pteridin-4-one 8-amino-2-thioxo-1H-benzo[g]pteridin-4-one MLS000776691 cid_5417965
Type:
Small organic molecule
Emp. Form.:
C10H7N5OS
Mol. Mass.:
245.26
SMILES:
Nc1ccc2nc3c(nc2c1)[nH]c(=S)[nH]c3=O
: