Target
Core protein
Ligand
BDBM54997
Substrate
Meas. Tech.
TR-FRET-based biochemical high-throughput dose response assay to identify inhibitors of Hepatitis C Virus (HCV) core protein dimerization.
IC50
>49751±n/a nM
Citation
 PubChem, PC TR-FRET-based biochemical high-throughput dose response assay to identify inhibitors of Hepatitis C Virus (HCV) core protein dimerization. PubChem Bioassay (2009)[AID] 
Target
Name:
Core protein
Synonyms:
Type:
Enzyme Catalytic Domain
Mol. Mass.:
14237.71
Organism:
Hepatitis C virus
Description:
gi_83779224
Residue:
126
  
Inhibitor
Name:
BDBM54997
Synonyms:
2-[2-[3-(4-methoxyphenyl)-5-thiophen-2-yl-3,4-dihydropyrazol-2-yl]-2-oxidanylidene-ethyl]sulfanyl-8-methyl-pyrido[1,2-a][1,3,5]triazin-4-one 2-[[2-[3-(4-methoxyphenyl)-5-thiophen-2-yl-3,4-dihydropyrazol-2-yl]-2-oxoethyl]thio]-8-methyl-4-pyrido[1,2-a][1,3,5]triazinone MLS001234978 cid_18573509
Type:
Small organic molecule
Emp. Form.:
C24H21N5O3S2
Mol. Mass.:
491.585
SMILES:
COc1ccc(cc1)C1CC(=NN1C(=O)CSc1nc2cc(C)ccn2c(=O)n1)c1cccs1
: