Target
Core protein
Ligand
BDBM55007
Substrate
Meas. Tech.
TR-FRET-based biochemical high-throughput dose response assay to identify inhibitors of Hepatitis C Virus (HCV) core protein dimerization.
IC50
42562±n/a nM
Citation
 PubChem, PC TR-FRET-based biochemical high-throughput dose response assay to identify inhibitors of Hepatitis C Virus (HCV) core protein dimerization. PubChem Bioassay (2009)[AID] 
Target
Name:
Core protein
Synonyms:
Type:
Enzyme Catalytic Domain
Mol. Mass.:
14237.71
Organism:
Hepatitis C virus
Description:
gi_83779224
Residue:
126
  
Inhibitor
Name:
BDBM55007
Synonyms:
MLS001081306 N-[2-[(4-methoxyphenyl)amino]-2-oxidanylidene-ethyl]-N-methyl-5,6-dihydro-4H-cyclopenta[b]thiophene-2-carboxamide SMR000715453 | cid_9426403
Type:
Small organic molecule
Emp. Form.:
C18H20N2O3S
Mol. Mass.:
344.428
SMILES:
COc1ccc(NC(=O)CN(C)C(=O)c2cc3CCCc3s2)cc1
: